patient #,"gender (1-m, 2-f)",Age,admission date,discharge date,"condition upon admission (1 - mild, 2 - medium, 3 - severe)","severity of covid (1- mild, 2- moderate, 3- moderate-severe, 4- severe)","Alcoholism (0- no, 1- yes)","Smoking (0 - no, 1 - yes)","Hypertension, degree","Atherosclerosis of large vessels (0 - no, 1 - detected)","Diabetes mellitus (0- no, 1- type 1, 2- type 2)","CKD, stage (0- no)",breathing rate,pulse,Blood pressure (S),Blood pressure (D),SpO2,Lung lesion (CT0-4),HGB in,HCT in,RBC in,MCV in,MCH in,MCHC in,PLT in,WBC in,Leu Ind in,ESR,Glucose,ALT,AST,Creatinine,D-dimer,CRP,IL-6,"serum protein, g/l",pH urine,urine protein,urine RBC,urine Leu,"Cys, mkM","CG, mkM","GSH, mkM","Hcy, mkM","SAM, nM","SAH, nM",SAM/SAH
18789,1,20,2020-08-24 00:00:00,2020-10-07 00:00:00,1,1,0.0,0.0,0,0.0,0.0,0.0,17,78.0,110.0,60.0,97.0,0,162.0,46.0,5.1,78.0,29.0,376.0,144.0,6.8,1.8,,3.3,20.0,16.0,82.0,,7.4,,,5.5,0.0,0.0,0.0,224.18324566283007,19.79026278751134,2.527822473764182,7.621901821480703,32.48970241635278,24.74094772383281,1.3131955484896658
20772,1,38,2020-09-16 00:00:00,2020-10-07 00:00:00,1,1,,,0,,,,15,76.0,130.0,80.0,99.0,0,137.0,42.0,4.5,93.0,30.0,330.0,230.0,4.2,,,5.2,67.0,53.0,78.0,,1.8,,59.0,5.0,0.0,0.0,0.0,193.9317771145304,16.236148781681617,1.9081651804936572,8.103372134532087,31.739744253836697,11.247114403822408,2.8220344449461394
20258,2,75,2020-09-10 00:00:00,2020-09-30 00:00:00,1,1,0.0,0.0,2,,0.0,,18,80.0,120.0,90.0,98.0,1,110.0,26.0,3.0,86.0,32.0,374.0,,4.9,1.7,,3.1,28.0,50.0,72.0,,11.6,,,7.0,0.0,0.0,0.0,245.15691458290962,13.036999216833324,0.739032421369633,5.936771189850852,135.2204477204477,26.83080808080808,5.039745627980922
20390,2,73,2020-09-11 00:00:00,2020-10-02 00:00:00,1,1,0.0,0.0,0,1.0,,,16,64.0,120.0,70.0,95.0,1,127.0,33.0,4.3,76.0,30.0,384.0,,5.4,1.1,41.0,4.7,36.0,33.0,70.0,,2.1,,,7.0,0.0,0.0,0.0,206.8824118501383,12.515377112974608,1.9731715326141825,8.396107895463404,24.288005810962137,16.37071401909028,1.4836253191302051
20412,1,68,2020-09-12 00:00:00,2020-10-01 00:00:00,1,1,,,0,,,,18,92.0,130.0,75.0,,1,131.0,,,,,,,,2.6,,4.4,23.0,22.0,93.0,,25.0,,,6.5,0.0,0.0,8.0,219.35773316773455,12.677659237241015,1.8808277859480098,9.098422134803629,56.9846955389124,24.44061962134251,2.331556909021698
21049,1,43,2020-09-18 00:00:00,2020-10-01 00:00:00,1,1,,,0,,,,,,,,,1,164.0,43.0,5.5,84.0,32.0,381.0,174.0,8.8,3.3,,3.8,168.0,143.0,90.0,,1.5,,,5.0,0.0,0.0,2.0,227.62247675674436,17.151088946322137,1.0297012178433471,5.594540600514276,42.26194157544271,18.197668083251607,2.3223822625020225
21520,2,67,23 сент,5 окт ,1,1,0.0,0.0,1,1.0,,,18,73.0,113.0,68.0,97.0,1,140.0,41.0,4.5,91.0,31.0,341.0,297.0,3.9,1.9,28.0,7.9,17.0,28.0,95.0,,9.9,,64.0,5.5,0.0,0.0,0.0,241.58114214199978,8.101091826247623,1.023736951549511,7.038786923658473,54.66140297600971,15.5163188871054,3.522833178005592
21527,2,71,2020-09-24 00:00:00,2020-10-02 00:00:00,1,1,0.0,0.0,2,1.0,,,18,73.0,113.0,68.0,97.0,1,101.0,28.0,3.3,84.0,30.0,360.0,243.0,19.0,8.0,82.0,4.7,,26.0,183.0,,31.0,20.99,52.0,5.0,0.15,1.5,10.0,296.3789169580276,20.883439208154826,1.7622823000279049,29.10063853186914,62.842395110765715,19.752522947411126,3.1814870069042085
21650,1,56,2020-09-24 00:00:00,2020-10-01 00:00:00,1,1,0.0,0.0,0,,,,16,75.0,123.0,82.0,99.0,1,156.0,44.0,5.2,85.0,30.0,354.0,294.0,8.0,2.7,10.0,6.0,45.0,27.0,97.0,,1.3,,,5.5,0.0,0.0,1.0,184.97396327322343,13.602736456924669,2.2893554354854166,9.828747075585037,66.06934087850118,12.61878797320455,5.235791346902458
21706,2,67,2020-09-26 00:00:00,2020-10-06 00:00:00,1,1,,,2,,,,18,65.0,120.0,80.0,97.0,1,109.0,33.0,3.7,88.0,29.0,320.0,416.0,5.2,1.4,,,,,,,24.0,28.82,58.6,,,,,230.81802577852642,11.667501785733323,1.0622003788242234,5.00995035483676,34.40940940940941,12.922262922262924,2.662800595871462
21707,1,57,2020-09-26 00:00:00,2020-10-01 00:00:00,1,1,0.0,0.0,0,,,,20,82.0,130.0,85.0,98.0,1,94.0,27.0,2.7,97.0,33.0,348.0,321.0,5.8,2.1,,,36.0,68.0,78.0,,24.0,,59.6,,,,,226.50594622543952,10.738107549120995,1.2035323572633756,7.89126707668862,58.21038429734081,22.055440533701404,2.639275520631452
22942,1,55,2020-10-10 00:00:00,2020-10-16 00:00:00,1,1,0.0,0.0,1,1.0,1.0,0.0,19,97.0,140.0,90.0,97.0,1,126.0,31.8,4.16,76.4,30.3,396.0,364.0,9.1,4.9,51.0,6.9,25.0,28.0,113.0,,57.0,3.0,,,,,,201.59852126688307,9.973372933710493,1.8609784493491286,5.642118481311863,53.39190121798817,11.978704525288375,4.457235012790568
22954,1,50,2020-10-13 00:00:00,2020-10-21 00:00:00,1,1,0.0,0.0,0,0.0,0.0,0.0,18,65.0,120.0,80.0,97.0,1,140.0,41.0,4.77,86.0,29.4,341.0,259.0,16.2,5.7,21.0,8.7,35.0,32.0,91.0,,2.7,3.36,58.0,,,,,269.34900771790615,16.266945439278196,2.3548208031243574,7.118109285245208,33.68471110406594,9.68207419820323,3.4790800415800414
23350,1,72,2020-10-13 00:00:00,2020-10-23 00:00:00,1,1,0.0,0.0,0,0.0,2.0,0.0,,,111.0,69.0,,1,166.0,51.0,5.9,86.4,28.1,325.0,126.0,3.8,1.0,12.0,6.2,20.6,25.2,84.1,,1.3,4.85,,,,,,231.60117200965186,14.58117890382627,2.8774106932273815,7.887493156518038,59.0975590975591,11.884411884411884,4.972695298037764
24877,1,65,2020-10-29 00:00:00,2020-11-05 00:00:00,1,1,0.0,0.0,0,0.0,0.0,0.0,,,124.0,83.0,,1,170.0,49.0,,,,347.0,243.0,6.48,2.8,,5.5,73.0,58.0,78.0,0.506,74.1,10.69,,,,,,198.71602895553255,,0.403722854188211,6.1943495346432265,95.28759528759528,10.286935286935286,9.26297217098404
25412,1,37,5 нояб,11 нояб,1,1,0.0,0.0,0,0.0,0.0,0.0,18,70.0,118.0,95.0,94.0,1,165.0,48.0,5.6,85.0,20.0,343.0,221.0,4.8,2.2,19.0,5.6,30.0,28.0,107.0,0.933,12.2,2.05,69.0,5.5,0.0,0.0,0.0,229.32486334761407,,3.196492661180294,9.34206981655123,63.61624782677414,6.1612364243943185,10.325240494732022
25604,2,21,"9, нояб","16, нояб",1,1,0.0,0.0,0,0.0,0.0,0.0,18,74.0,120.0,78.0,97.0,1,147.0,44.0,5.1,86.0,28.0,334.0,349.0,3.7,0.9,17.0,7.1,14.0,25.0,86.0,0.315,1.4,1.5,73.0,6.0,0.0,80.0,0.0,176.95934337059987,,2.041462759244029,16.585755115667418,63.17758436402503,5.669895076674737,11.142637299220928
25765,1,67,"11, нояб","23, нояб",1,1,0.0,0.0,1,1.0,0.0,0.0,21,84.0,130.0,75.0,97.0,1,134.0,40.0,4.5,88.0,29.0,335.0,261.0,3.7,2.1,34.0,4.3,17.0,29.0,110.0,1.53,3.2,1.7,61.0,5.0,0.3,8.0,45.0,204.42577071325778,,0.9440197857984827,28.778067847354297,66.44144144144144,11.802721088435373,5.6293325025313505
21003,1,67,2020-09-18 00:00:00,2020-10-01 00:00:00,1,1,,,2,1.0,,,16,72.0,130.0,80.0,,2,186.0,48.0,5.9,81.0,31.0,387.0,228.0,5.8,3.2,10.0,,32.0,28.0,107.0,2.31,4.9,,70.0,5.0,0.0,0.0,2.0,180.2939366702426,19.72184905623907,1.208574548898704,5.210079025279715,301.23873873873873,21.577380952380953,13.96085740913327
21051,2,83,2020-09-19 00:00:00,2020-10-02 00:00:00,1,1,,,0,,,,,,,,,2,82.0,23.0,2.9,79.0,28.0,365.0,267.0,6.0,5.3,72.0,,34.0,45.0,140.0,,101.0,,57.0,5.0,0.3,0.0,2.0,308.7355088693369,11.03252243832571,1.8103659626866637,6.866247486114875,66.91474082778431,21.595353117092248,3.0985712743369205
21424,2,65,2020-09-23 00:00:00,2020-10-05 00:00:00,1,1,,,3,,,,,,,,,2,83.0,28.0,3.6,76.0,22.0,300.0,245.0,5.9,1.6,,6.2,11.0,21.0,144.0,,40.0,47.19,,5.5,40.0,3.0,20.0,249.8749586011585,12.020195875661539,1.7213469324303314,7.9352961453454185,55.15248855412789,18.320647931303668,3.01040054701839
21525,1,53,2020-09-24 00:00:00,2020-10-01 00:00:00,1,1,0.0,0.0,0,,,,16,73.0,130.0,90.0,97.0,2,142.0,41.0,5.2,78.0,27.0,346.0,476.0,10.0,3.3,85.0,5.1,80.0,56.0,89.0,,48.0,2.56,61.0,5.0,0.0,0.0,0.0,250.6480523957256,10.079627714581179,1.7662874870734233,9.13419510513616,,,
21695,1,69,2020-09-25 00:00:00,2020-10-01 00:00:00,1,1,0.0,0.0,2,,,,19,82.0,128.0,80.0,93.0,2,151.0,44.0,5.1,85.0,29.0,343.0,135.0,2.7,4.3,,,15.0,24.0,86.0,,22.8,,59.0,,,,,218.8644309843896,17.649874427537302,3.4484660461909686,6.16685871866844,45.732755656419776,30.025445292620866,1.5231333027943197
21705,1,70,2020-09-26 00:00:00,2020-10-06 00:00:00,1,1,,,0,1.0,,,18,65.0,130.0,80.0,97.0,2,118.0,33.0,3.5,93.0,33.0,357.0,291.0,4.0,1.5,,,64.0,56.0,94.0,,32.0,,62.0,,,,,245.0669245339615,7.79080865309787,0.831705930598178,7.793535557788355,53.48234621520189,15.91363259735829,3.3607880468523645
22312,1,45,2020-10-02 00:00:00,2020-10-14 00:00:00,1,1,0.0,0.0,1,0.0,0.0,0.0,,,120.0,75.0,,2,120.0,35.1,3.94,89.1,30.5,342.0,294.0,3.9,1.1,76.0,4.4,19.0,23.0,87.0,,14.9,,,,,,,271.3087936383411,13.750490318439542,1.1963769924758407,11.028683394110924,46.33204633204633,10.249433106575964,4.520449653193016
22348,1,64,2020-10-02 00:00:00,2020-10-09 00:00:00,1,1,0.0,0.0,0,0.0,0.0,0.0,,,103.0,86.0,,2,123.0,35.6,4.02,88.6,30.6,346.0,178.0,3.5,4.9,46.0,5.1,24.0,29.0,85.0,,38.9,36.7,,,,,,263.12597971502396,10.515477924803177,1.2432159059171641,7.726433855699626,,6.857142857142857,
23460,1,60,2020-10-14 00:00:00,2020-10-29 00:00:00,1,1,0.0,0.0,2,0.0,0.0,0.0,,,170.0,99.0,,2,171.0,47.0,5.4,87.0,31.7,364.0,391.0,11.2,1.1,,7.0,,,,,84.4,5.66,,,,,,216.9571156816934,14.862920831897048,2.9593882058549417,8.963060405134131,50.98280098280098,7.987012987012987,6.383212480773456
24939,1,53,2020-10-30 00:00:00,2020-11-12 00:00:00,1,1,1.0,0.0,0,0.0,0.0,0.0,,,131.0,87.0,,2,123.0,37.0,,,,,,5.21,4.9,,5.4,29.0,27.0,116.0,0.897,99.9,36.11,61.0,,,,,201.5739888770367,,1.09772085107769,8.600021171086812,70.38288288288288,9.50091575091575,7.408010420058614
24940,2,56,2020-10-30 00:00:00,2020-11-12 00:00:00,1,1,1.0,0.0,0,0.0,0.0,0.0,,,127.0,84.0,,2,125.0,40.0,,,,312.5,,3.2,2.1,10.0,6.78,26.0,24.0,134.0,0.388,5.5,4.39,65.0,,,,,296.3789169580276,,0.776004990069106,13.544180167758244,109.4254631990481,13.881401617250674,7.882882882882882
25217,2,61,3 нояб,13 нояб,1,1,0.0,0.0,0,0.0,0.0,0.0,18,80.0,120.0,90.0,98.0,2,130.0,40.0,4.7,90.0,31.0,343.0,269.0,5.8,,44.0,7.5,70.0,62.0,69.0,0.748,2.3,8.38,58.0,6.0,0.3,0.0,0.0,197.8390329137396,,1.1078501537091292,10.635494162204388,49.64818833431972,4.066736183524505,12.208362208362209
21526,1,63,2020-09-24 00:00:00,2020-10-01 00:00:00,1,1,,,2,1.0,,,16,73.0,130.0,90.0,97.0,3,,,,,,,530.0,7.7,,,,,,,,,,59.0,6.5,0.0,0.0,2.0,129.44139992680059,10.668939615383671,2.3299771313192847,3.1386465965949983,79.65981248423995,12.995274445656124,6.1299061299061295
21636,1,65,2020-09-24 00:00:00,2020-10-01 00:00:00,1,1,0.0,0.0,0,,,,16,73.0,130.0,90.0,97.0,3,175.0,,5.7,89.0,30.0,357.0,328.0,6.9,3.2,82.0,5.2,164.0,111.0,145.0,,126.0,,,5.5,1.0,0.0,2.0,210.82984323717807,10.969689207813483,1.6440885640173792,6.759572357291546,103.33211440222509,22.579511509400806,4.576366249518
24805,1,84,2020-10-29 00:00:00,2020-11-13 00:00:00,1,1,0.0,0.0,0,1.0,0.0,0.0,,,100.0,60.0,,3,139.0,40.0,4.3,,,347.0,420.0,1.79,2.7,,5.4,16.0,37.0,93.0,1.23,39.4,2.46,65.0,,,,,267.78434087602756,,1.181445322770056,12.561653199656458,,,
24948,1,42,2020-10-31 00:00:00,2020-11-09 00:00:00,1,1,1.0,0.0,0,0.0,0.0,0.0,,,135.0,78.0,,3,147.0,42.0,5.1,84.0,29.4,350.0,271.0,3.9,1.5,,5.7,27.0,37.0,92.4,,115.0,14.06,,,,,,205.18540404786526,,1.3742798049933518,9.05525188358694,80.88523305914609,8.343685300207039,9.694185500637113
25414,1,61,5 нояб,13 нояб,1,1,0.0,0.0,2,,2.0,0.0,20,89.0,157.0,78.0,93.0,3,146.0,42.0,4.9,85.0,29.0,347.0,221.0,4.3,3.3,95.0,13.0,25.0,30.0,127.0,0.389,125.0,34.81,,5.0,0.3,0.0,0.0,232.7981668439808,,9.893388288335208,7.997887109133788,131.41402271837055,13.436853002070391,9.780119102153002
27444,1,75,"13, нояб","10, дек",1,1,0.0,0.0,0,1.0,0.0,0.0,19,84.0,130.0,80.0,98.0,3,93.0,25.0,2.7,92.0,34.0,372.0,78.0,3.2,3.6,86.0,3.3,48.0,88.0,121.0,,91.0,97.98,54.0,5.5,0.0,10.0,0.0,293.7157323759536,14.480497941503582,0.669499131724259,15.133704708200817,80.98691025520294,25.38576406172225,3.1902490726020143
21057,1,79,2020-09-19 00:00:00,2020-10-07 00:00:00,1,3,,,3,,2.0,,18,78.0,130.0,80.0,99.0,1,166.0,45.0,5.4,83.0,30.0,368.0,142.0,4.3,1.5,22.0,,39.0,26.0,97.0,,1.4,,67.0,5.0,0.0,0.0,2.0,239.94040870232297,14.122496782817487,1.4114665190530182,7.2341307911510135,47.52458880899247,18.154458521430996,2.6177915883798235
21176,1,58,2020-09-21 00:00:00,2020-10-05 00:00:00,1,3,,,0,,,,,,,,,1,162.0,45.0,5.4,83.0,30.0,360.0,354.0,6.8,3.2,38.0,8.1,18.0,28.0,82.0,,3.5,4.14,78.0,5.5,0.0,0.0,2.0,226.1140057805001,10.92753162039615,1.1625633070824384,5.204090764457879,51.56099495722137,14.555256064690026,3.542431320209098
20569,1,64,2020-09-14 00:00:00,2020-10-30 00:00:00,1,3,0.0,0.0,0,,,,19,78.0,120.0,85.0,97.0,2,162.0,44.0,5.0,87.0,32.0,368.0,,7.3,1.9,18.0,4.1,248.0,84.0,143.0,,2.7,,73.7,,,,,201.97493723863937,26.078781611356586,1.061981413584309,6.517623668606088,298.7197724039829,42.857142857142854,6.970128022759602
21503,1,48,2020-09-23 00:00:00,2020-10-07 00:00:00,1,3,0.0,0.0,0,,,,,,,,,3,149.0,43.0,4.9,87.0,30.0,346.0,227.0,11.0,1.6,27.0,4.9,101.0,50.0,82.0,,,342.2,66.0,5.5,0.0,0.0,0.0,200.50619726331252,15.889573310552587,1.3827690601441784,7.172526714925889,58.96226415094339,16.537511230907455,3.565365025466893
20887,1,50,2020-09-17 00:00:00,2020-10-02 00:00:00,2,1,0.0,0.0,3,1.0,,1.0,16,75.0,135.0,95.0,99.0,1,146.0,41.0,5.0,80.0,28.0,357.0,274.0,7.2,,59.0,3.8,48.0,31.0,72.0,,0.1,,50.0,5.5,3.0,10.0,1.0,201.70584234700056,13.806981749070685,2.377403256410495,5.00768607283602,76.46022406170006,22.60879751654659,3.3818792886150395
21056,2,75,2020-09-19 00:00:00,2020-10-07 00:00:00,2,3,,,3,1.0,0.0,0.0,18,89.0,160.0,100.0,99.0,1,138.0,44.0,5.1,86.0,27.0,313.0,210.0,10.0,2.4,11.0,5.3,,,,,23.0,,87.0,5.0,0.0,0.0,15.0,192.07548967333597,26.38081964870442,6.86118892240366,4.2455872930019,74.28101178101178,10.966117216117215,6.773683913558654
22328,1,81,2020-10-02 00:00:00,2020-10-08 00:00:00,2,3,0.0,0.0,2,1.0,0.0,0.0,,,120.0,70.0,,1,128.0,36.8,3.9,94.4,32.8,348.0,331.0,9.6,3.5,52.0,4.4,23.0,35.0,112.0,,83.4,,,,,,,221.66772303210232,20.535744070454015,0.922485016290267,7.082518738818982,51.28205128205128,14.340659340659341,3.5759897828863343
23301,1,61,2020-10-13 00:00:00,2020-10-22 00:00:00,2,3,0.0,0.0,2,0.0,0.0,0.0,,,130.0,80.0,,1,147.0,42.0,5.2,80.8,28.3,350.0,309.0,13.4,11.5,69.0,,20.4,36.6,82.1,,,46.95,,,,,,227.3877462433133,15.945765827875446,1.7600571961137286,5.94362125317975,166.03141603141603,32.61090761090761,5.09128473247038
24143,1,64,2020-10-21 00:00:00,2020-10-30 00:00:00,2,3,0.0,0.0,2,0.0,0.0,0.0,,,130.0,80.0,,1,153.0,45.0,5.06,88.9,30.2,340.0,161.0,5.11,5.7,77.0,9.3,36.0,33.0,107.0,2.22,49.3,5.07,66.0,,,,,282.08126230109747,,0.6257297261233613,9.830453347566468,107.62671068014579,19.883678662304618,5.412816838776619
25634,2,88,"9, нояб","17, ноб",2,3,0.0,0.0,1,1.0,0.0,0.0,22,88.0,140.0,80.0,95.0,1,129.0,41.0,5.0,80.0,25.0,314.0,402.0,,,,,19.0,30.0,91.0,,4.3,18.51,61.4,5.0,1.0,10.0,70.0,254.1568481190771,,2.745604963805584,12.22972858426433,85.28749337572866,9.75140056022409,8.746178853898781
23338,1,56,2020-10-13 00:00:00,2020-10-22 00:00:00,2,3,0.0,0.0,2,0.0,0.0,0.0,18,105.0,130.0,80.0,96.0,2,161.0,49.0,5.7,86.0,28.2,329.0,210.0,5.2,5.3,71.0,6.6,27.6,30.0,70.0,,54.8,2.51,,,,,,223.09818130330237,13.403185310857316,0.9254038528152758,4.813214655045058,45.45830233903628,9.30537352555701,4.885166856997843
24154,1,40,2020-10-21 00:00:00,2020-10-30 00:00:00,2,3,0.0,0.0,0,0.0,0.0,0.0,,,135.0,95.0,,2,185.0,53.0,5.71,92.8,32.4,349.0,166.0,3.75,4.6,59.0,5.5,41.0,44.0,134.0,0.478,73.6,15.97,64.0,,,,,228.99865443815807,,0.24355867168690334,17.47042359245048,120.28512028512029,12.977498691784406,9.268744551002616
25137,1,52,2 нояб,19 нояб,2,3,0.0,0.0,0,0.0,1.0,0.0,18,94.0,130.0,90.0,94.0,2,150.0,46.0,5.1,90.0,29.0,325.0,154.0,3.4,2.6,35.0,11.0,59.0,61.0,97.0,0.706,56.0,6.4,68.0,5.5,0.3,10.0,28.0,192.07843200620474,,2.3310657962771457,7.313857290589452,75.66777303619408,8.354218880534669,9.057432432432433
25993,2,87,"13, нояб","20, нояб",2,3,0.0,0.0,0,1.0,2.0,,18,97.0,168.0,94.0,94.0,2,117.0,43.0,3.6,87.0,28.0,330.0,142.0,3.6,3.5,,8.9,20.0,26.0,88.0,0.44,6.6,1.5,,5.0,0.0,0.0,2.0,377.56886340133497,24.90927893202971,0.8270040523891284,18.52377253182783,53.37008787929033,6.529360210341805,8.173861781244332
22335,1,57,2020-10-02 00:00:00,2020-10-09 00:00:00,2,3,0.0,0.0,0,0.0,2.0,0.0,,83.0,120.0,80.0,94.0,3,141.0,41.0,4.5,91.1,31.3,344.0,276.0,11.5,5.7,76.0,4.5,47.0,51.0,154.0,,50.4,14.1,,,,,,306.26938986556354,10.978541882109619,0.8410892795587729,14.896465242775369,286.1402327594498,44.06032875783765,6.494282744282744
22992,1,54,2020-10-13 00:00:00,2020-10-30 00:00:00,2,3,0.0,0.0,1,0.0,0.0,0.0,22,80.0,150.0,90.0,96.0,3,144.0,43.0,4.9,83.7,29.6,335.0,305.0,9.5,5.7,,6.1,180.0,121.0,87.0,,71.8,1.92,57.0,,,,,249.8944026100762,11.895305649824492,1.4570983293764659,9.893140296449499,41.79660429660429,15.247252747252745,2.7412547682817956
23339,1,55,2020-10-13 00:00:00,2020-10-22 00:00:00,2,3,0.0,0.0,0,0.0,0.0,0.0,,,130.0,80.0,,3,154.0,48.0,5.6,85.7,27.5,320.8,235.0,3.4,1.9,86.0,5.9,,,,,121.9,1.69,,,,,,208.78064266697683,13.200856218744402,1.246294905121282,4.375136253109367,51.541926541926536,10.508241758241757,4.904904904904905
24119,1,50,2020-10-21 00:00:00,2020-11-03 00:00:00,2,3,0.0,0.0,0,0.0,0.0,0.0,,,120.0,80.0,,3,144.0,43.0,4.97,86.5,29.0,335.0,331.0,7.7,6.1,82.0,9.1,156.0,106.0,,2.15,37.0,13.87,,,,,,205.0822439653877,,0.1617479383766871,6.142806636084816,108.89696803402387,13.747884940778341,7.920997920997921
25468,1,62,6 нояб,19 нояб,2,3,0.0,0.0,0,1.0,0.0,0.0,18,84.0,120.0,80.0,96.0,3,149.0,42.0,4.5,93.0,29.0,354.0,301.0,17.0,6.1,16.0,7.3,22.0,40.0,101.0,1.53,2.5,12.64,64.0,5.5,0.0,0.0,0.0,248.14223713245767,,0.14901188023679046,16.048253792474494,122.82747349119032,12.010113780025286,10.227003319108583
24949,1,33,2020-10-31 00:00:00,2020-11-09 00:00:00,2,3,1.0,0.0,0,0.0,0.0,0.0,,,120.0,80.0,,4,149.0,43.0,5.2,82.7,28.7,346.5,196.0,4.5,3.3,93.0,4.6,36.0,36.0,102.6,,6.3,6.3,,,,,,209.17620175467857,,1.2158488174266937,10.852820495713381,87.85812839866892,7.357357357357357,11.941533370104796
27219,1,46,21 нояб,02 дек,3,4,0.0,0.0,0,0.0,0.0,0.0,,,,,,2,,,,,,,,,,,,,,,,,,,,,,,237.24260599793175,11.487238883143744,0.4567114788004136,10.180889348500516,58.46271803718612,2.912867274569402,20.07050528789659
20989,1,49,2020-09-18 00:00:00,2020-10-01 00:00:00,3,4,,,2,,,,ивл,90.0,120.0,80.0,97.0,3,126.0,33.0,4.1,80.0,30.0,381.0,206.0,13.0,6.7,,6.3,,,,0.83,16.9,,50.0,6.0,0.0,0.0,0.0,231.66094005404142,17.009404179567973,0.9064525226916395,5.147582843816623,51.40733954293276,32.82216841538875,1.566238369517058
24282,1,64,2020-10-22 00:00:00,2020-11-19 00:00:00,3,4,0.0,0.0,2,1.0,0.0,0.0,,,130.0,80.0,,4,153.0,47.6,5.1,93.2,29.9,321.0,120.0,10.7,5.46,,7.6,,,,,,1080.0,,,,,,228.9355172298762,,0.2543616772859192,13.133485672348801,117.24960254372019,119.747899159664,0.9791370317686096
